*Heading
** Job name: apr16-deforme-50 Model name: Model-1
*Preprint, echo=NO, model=NO, history=NO, contact=NO
**
** PARTS
**
*Part, name=Part-1
*End Part
**
*Part, name=Part-2
*End Part
**
**
** ASSEMBLY
**
*Assembly, name=Assembly
**
*Instance, name=Part-1-1, part=Part-1
*Node
*Element, type=CPE4
*Nset, nset=_PickedSet3, internal
*Elset, elset=_PickedSet3, internal, generate
*Nset, nset=_PickedSet4, internal
*Elset, elset=_PickedSet4, internal, generate
** Region: (Section-1:Picked)
*Elset, elset=_PickedSet3, internal, generate
** Section: Section-1
*Solid Section, elset=_PickedSet3, material=Material-1
1.,
** Region: (Section-2:Picked)
*Elset, elset=_PickedSet4, internal, generate
** Section: Section-2
*Solid Section, elset=_PickedSet4, material=Material-2
1.,
*End Instance
**
*Instance, name=Part-2-1, part=Part-2
*Node
*Nset, nset=Part-2-1-RefPt_, internal
*Surface, type=SEGMENTS, name=RigidSurface_, internal
START,          10.,           5.
 LINE,         -10.,           5.
*Rigid Body, ref node=Part-2-1-RefPt_, analytical surface=RigidSurface_
*End Instance
**
*Nset, nset=Set-1, instance=Part-2-1
*Nset, nset=_PickedSet9, internal, instance=Part-1-1
*Elset, elset=_PickedSet9, internal, instance=Part-1-1
*Nset, nset=_PickedSet10, internal, instance=Part-1-1
*Elset, elset=_PickedSet10, internal, instance=Part-1-1
*Nset, nset=_PickedSet11, internal, instance=Part-2-1
*Nset, nset=_PickedSet12, internal, instance=Part-2-1
*Elset, elset=__PickedSurf8_S2, internal, instance=Part-1-1, generate
*Elset, elset=__PickedSurf8_S1, internal, instance=Part-1-1, generate
*Surface, type=ELEMENT, name=_PickedSurf8, internal
__PickedSurf8_S2, S2
__PickedSurf8_S1, S1
*End Assembly
**
** MATERIALS
**
*Material, name=Material-1
***Elastic
**240., 0.33
***Plastic
**5.,0.
*USER MATERIAL,CONSTANTS=7
*DEPVAR
*Material, name=Material-2
*Elastic
 2e+06, 0.33
**
** INTERACTION PROPERTIES
**
*Surface Interaction, name=IntProp-1
1.,
**
** INTERACTIONS
**
** Interaction: Int-1
*Contact Pair, interaction=IntProp-1
_PickedSurf8, Part-2-1.RigidSurface_
** ----------------------------------------------------------------
**
** STEP: Step-1
**
*Step, name=Step-1, inc=1000
*Static
**1., 1., 1e-05, 1.
1e3, 5e4, 1e-4, 1e3
**
** BOUNDARY CONDITIONS
**
** Name: BC-1 Type: Symmetry/Antisymmetry/Encastre
*Boundary
_PickedSet9, XSYMM
** Name: BC-2 Type: Symmetry/Antisymmetry/Encastre
*Boundary
_PickedSet10, YSYMM
** Name: BC-3 Type: Symmetry/Antisymmetry/Encastre
*Boundary
_PickedSet11, XSYMM
** Name: BC-4 Type: Displacement/Rotation
*Boundary
_PickedSet12, 2, 2, -0.5
**
** OUTPUT REQUESTS
**
*Restart, write, frequency=0
**
** FIELD OUTPUT: F-Output-1
**
*Output, field, variable=PRESELECT
*Element Output
LE, S, SDV
**
** HISTORY OUTPUT: H-Output-1
**
*Output, history
*Node Output, nset=Set-1
RF2, U2
*End Step